حوضه مرکزی
type: Concept
preferred label: Central Basin @en
related: تنسی
scope note: مرکز تنسی. ضمناً شاید در مناطق دیگر نیز واقع شود.

تنسی
type: Concept
preferred label: Tennessee @en
related: حوضه مرکزی