حوضه ریچموند
type: Concept
preferred label: Richmond Basin @en
related: ویرجینیا
scope note: حوضه ریفتی کوچک نزدیک ریچموند ویرجینیا. ممکن است در محلهای دیگری نیز واقع شده باشد

ویرجینیا
type: Concept
preferred label: Virginia @en
related: حوضه ریچموند