دهانه آتشفشان
type: Concept
preferred label: crater @en
related: حلقه دهانه آتشفشان

حلقه دهانه آتشفشان
type: Concept
preferred label: crater ring @en
related: دهانه آتشفشان
scope note: لبه حلقوی کم‌ارتفاعِ متشکل از مواد خردشده