زمین‏لغزه چرخشی
type: Concept
broader: زمین‌لغزه
preferred label: rotational landslide @en
scope note: زمین‏لغزه‏ای که در آن برش در امتداد سطحی منحنی رخ داده است

زمین‌لغزه
type: Concept
narrower: زمین‏لغزه چرخشی
preferred label: landslide (landslip) @en