حاشیه قاره‏ای فعال
type: Concept
broader: حاشیه قاره‌ای
preferred label: active continental margin @en
scope note: نوعی حاشیه قاره‏ای با فعالیت آتشفشانی و لرزه‏خیزی

حاشیه قاره‌ای
type: Concept
narrower: حاشیه قاره‏ای فعال
preferred label: continental margin @en