حاشیه قاره‏ای نافعال
type: Concept
broader: حاشیه قاره‌ای
preferred label: passive continental margin @en
scope note: نوعی حاشیه قاره‏ای بدون فعالیت آتشفشانی و لرزه‏خیزی

حاشیه قاره‌ای
type: Concept
narrower: حاشیه قاره‏ای نافعال
preferred label: continental margin @en