تاقدیسگان
type: Concept
broader: تاقدیس
preferred label: anticlinorium @en
scope note: ساختاری تاقدیسی متشکل از مجموعه‌ای از تاقدیس‌ها و ناودیس‌ها

تاقدیس
type: Concept
narrower: تاقدیسگان
preferred label: anticline @en