چین اصلی
type: Concept
broader: چین(ساختار زمین‌شناسی)
preferred label: major fold @en
scope note: چینی بزرگ‏مقیاس یا غالب در یک ناحیه که چین‌های فرعی زیادی همراه با آن یافت می‌شوند

چین(ساختار زمین‌شناسی)
type: Concept
narrower: چین اصلی
preferred label: fold @en