چین تاقدیسی
type: Concept
broader: چین(ساختار زمین‌شناسی)
preferred label: anticlinal fold @en
scope note: چینی که در آن لایه‏های قدیمی‏تر در زیر لایه‏های جدیدتر تحدب یافته است

چین(ساختار زمین‌شناسی)
type: Concept
narrower: چین تاقدیسی
preferred label: fold @en