چین خمشی‌ـ‌ لغزشی
type: Concept
broader: چین خمشی
preferred label: flexure-slip fold @en
scope note: نوعی چین خمشی که در آن چین‌خوردگی در طول صفحات لایه‌بندی یا سطوح برگوارگی به‌صورت لغزشی است

چین خمشی
type: Concept
narrower: چین خمشی‌ـ‌ لغزشی
preferred label: flexure fold @en