چین موازی
type: Concept
broader: چین(ساختار زمین‌شناسی)
preferred label: parallel fold @en
scope note: چینی که در آن ضخامت لایه‏ها ثابت می‌ماند

چین(ساختار زمین‌شناسی)
type: Concept
narrower: چین موازی
preferred label: fold @en