چوب سیلیسی‌شده
type: Concept
preferred label: silicified wood @en
related: چوب
scope note: ماده‌ای که براثر سیلیسی ‌شدن چوب به وجود می‌آید

چوب
type: Concept
preferred label: wood @en
related: چوب سیلیسی‌شده