چندضلعی شکافه‏ای
type: Concept
broader: چندضلعی
preferred label: fissure polygon @en
scope note: شکلی حاصل از به هم پیوستن شیارها یا شکافه‏ها که الگوی سطحی چندضلعی محدبی را به وجود می‌آورد

چندضلعی
type: Concept
narrower: چندضلعی شکافه‏ای
preferred label: polygon @en