چهارریختی
type: Concept
broader: چندریختی
preferred label: tetramorphism @en
scope note: نوعی چندریختی که در آن چهار شکل بلوری ایجاد می‌شود

چندریختی
type: Concept
narrower: چهارریختی
preferred label: polymorphism @en