دوریخت
type: Concept
preferred label: dimorph @en
related: دوریختی

دوریختی
type: Concept
broader: چندریختی
preferred label: dimorphism @en
related: دوریخت
scope note: نوعی چندریختی که در آن دو گونۀ بلوری ایجاد می‌شود

چندریختی
type: Concept
narrower: دوریختی
preferred label: polymorphism @en