سه‏ریختی
type: Concept
broader: چندریختی
preferred label: trimorphism @en
scope note: نوعی چندریختی که در آن سه شکل بلوری ایجاد می‌شود

چندریختی
type: Concept
narrower: سه‏ریختی
preferred label: polymorphism @en