علم زمین‌ساخت
type: Concept
preferred label: tectonics @en
related: چرخه زمین‏ساختی

چرخه زمین‏ساختی
type: Concept
preferred label: tectonic cycle @en
related: چرخه
related: علم زمین‌ساخت
scope note: چرخه مربوط به نیروهای دخیل در زمین‏ساخت یا ساختارها و عوارض ناشی از این نیروها

چرخه
type: Concept
preferred label: cycle @en
related: چرخه زمین‏ساختی