چار
type: Concept
preferred label: Char @en
related: قزاقستان
scope note: کمربند سنگی در نواحی دریاچه زاسیان و حوزه کالبا شمال شرق قزاقستان.

قزاقستان
type: Concept
preferred label: Kazakhstan @en
related: چار