جودوست
type: Concept
preferred label: atmophile @en
related: جو
scope note: ویژگی عناصری که بیش از همه در جوّ زمین وجود دارند، مانند H, C, N, O, I و گازهای نادر

جو
type: Concept
preferred label: atmosphere @en
related: جودوست