جزیره های
type: Concept
preferred label: High Island @en
related: ناحیه گالوستون تگزاس
related: خلیج مکزیک
scope note: جزیره‌ای در خلیج مکزیک کناره جنوب شرقی ساحل تگزاس. شاید در محل‌های دیگری نیز واقع شده است.

ناحیه گالوستون تگزاس
type: Concept
preferred label: Galveston County Texas @en
related: جزیره های

خلیج مکزیک
type: Concept
preferred label: Gulf of Mexico @en
related: جزیره های