سرزمینهای شمال غربی
type: Concept
preferred label: Northwest Territories @en
related: جزیره ویکتوریا

جزیره ویکتوریا
type: Concept
preferred label: Victoria Island @en
related: نیجریه
related: سرزمینهای شمال غربی
scope note: بخش فرانکلین، سرزمینهای شمال غربی. همچنین در لاگوس، جنوب غرب نیجریه

نیجریه
type: Concept
preferred label: Nigeria @en
related: جزیره ویکتوریا