سرزمینهای شمال غربی
type: Concept
preferred label: Northwest Territories @en
related: جزیره باتورست

جزیره باتورست
type: Concept
preferred label: Bathurst Island @en
related: سرزمینهای شمال غربی
scope note: جزیره ای در جزایر پری، شمال غرب ناحیه فرانکلین، ایالات شمال غرب، کانادا و نیز جزیره ای در ایالت شمالی، استرالیا