دگرگونی
type: Concept
preferred label: metamorphism @en
related: جریان‌ریختی

جریان‌ریختی
type: Concept
preferred label: rheomorphism @en
related: دگرگونی
scope note: ذوب شدن سنگهای پیشین در حین عمل گرانیتی و میگماتیتی شدن