جریان آب زیرزمینی
type: Concept
preferred label: ground water flow @en
related: آب زیرزمینی
scope note: حرکت یا جریان طبیعی یا مصنوعی آب در زون اشباع‏شده

آب زیرزمینی
type: Concept
preferred label: ground water @en
related: جریان آب زیرزمینی