جدایش ماگمایی
type: Concept
broader: جداسازی
preferred label: magmatic segregation @en
scope note: تمرکز بلورهای یک کانی یا کانی‌های خاص در قسمت‌های خاصی از یک ماگما در طی سرد شدن و تبلور آن

جداسازی
type: Concept
narrower: جدایش ماگمایی
preferred label: segregation @en