ایرقیزیت
type: Concept
broader: تکتیت(شیشه طبیعی)
preferred label: irghizite @en
related: قزاقستان
scope note: گروه تکتیت که با دهانه ژامانیشن در قزاقستان مشترک است.

تکتیت(شیشه طبیعی)
type: Concept
narrower: ایرقیزیت
preferred label: tektite @en

قزاقستان
type: Concept
preferred label: Kazakhstan @en
related: ایرقیزیت