تغذیه آب زیرزمینی
type: Concept
preferred label: ground water recharge @en
related: آب زیرزمینی
scope note: فرایندی که ازطریق آن، آب به زون اشباع‏شدۀ زیرزمینی افزوده می‌شود

آب زیرزمینی
type: Concept
preferred label: ground water @en
related: تغذیه آب زیرزمینی