ترک انقباضی
type: Concept
broader: ترک
preferred label: shrinkage crack @en
scope note: ترک کوچکی که در رسوب دانه‏ریز یا سنگ براثر از دست رفتن آب در طی فرایند خشک شدن به وجود می‌آید

ترک
type: Concept
narrower: ترک انقباضی
preferred label: crack @en