تداخل‌سنجی خط مبنای بسیار طویل
type: Concept
preferred label: very long baseline interferometry @en
related: تداخل‌سنجی

تداخل‌سنجی
type: Concept
preferred label: interferometry @en
related: تداخل‌سنجی خط مبنای بسیار طویل
scope note: اسبابی که پدیده حاصل از تداخل دو دسته نور را مورد استفاده قرار داده و با شکستن نور واحدی طول موج نور و تجزیه طیف نور را مود مطالعه قرار می‌دهد.