تخلخل اولیه
type: Concept
broader: تخلخل
preferred label: primary porosity @en
scope note: تخلخلی که هم‌زمان با رسوب‏گذاری در رسوب ایجاد می‌شود

تخلخل
type: Concept
narrower: تخلخل اولیه
preferred label: porosity @en