تخلخل بینِ‏دانه‏ای
type: Concept
broader: تخلخل
preferred label: intergranular porosity @en
scope note: تخلخل بین دانه‏ها یا اجزای یک سنگ، مانند سنگ‏آوارها و زیست‏آوارها

تخلخل
type: Concept
narrower: تخلخل بینِ‏دانه‏ای
preferred label: porosity @en