تخلخل خمیره
type: Concept
broader: تخلخل
preferred label: matrix porosity @en
scope note: تخلخل خمیره یا بخش ریزدانۀ یک سنگ کربناتی

تخلخل
type: Concept
narrower: تخلخل خمیره
preferred label: porosity @en