تخلخل شکستگی
type: Concept
broader: تخلخل
preferred label: fracture porosity @en
scope note: تخلخل حاصل از وجود حفره‏های تشکیل‌شده از شکسته شدن سنگ

تخلخل
type: Concept
narrower: تخلخل شکستگی
preferred label: porosity @en