پیش‌لایه
type: Concept
preferred label: foreset bed @en
related: پس‌لایه
scope note: هریک از واحدهای مایل درون لایه‌بندی چلیپایی که آرایشی سامانمند دارند

پس‌لایه
type: Concept
preferred label: backset bed @en
related: پیش‌لایه