پیش‌کرانه
type: Concept
preferred label: foreshore @en
related: پس‌کرانه
scope note: منطقه‏ای میان بالاترین و پایین‏ترین داغاب دریا

پس‌کرانه
type: Concept
preferred label: backshore @en
related: پیش‌کرانه