خردقاره
type: Concept
preferred label: microcontinent @en
related: پشته بدون لرزه

پشته میان‌اقیانوسی
type: Concept
preferred label: mid-ocean ridge @en
related: پشته بدون لرزه

پشته بدون لرزه
type: Concept
alternative label: پشته بی‏لرزه
preferred label: aseismic ridge @en
related: خردقاره
related: پشته میان‌اقیانوسی
scope note: پشته‏ای زیردریایی که بخشی از پوستۀ قاره‏ای است و با پشتۀ میان‏اقیانوسی که ازلحاظ لرزه‏ای فعال است تفاوت دارد