سرزمینهای شمال غربی
type: Concept
preferred label: Northwest Territories @en
related: گروه یلونایف

گروه یلونایف
type: Concept
broader: آرکئن
preferred label: Yellowknife Group @en
related: سرزمینهای شمال غربی
scope note: شامل کوارتزیت، کنگلومرا، گریواک، متا-بازالت، متا-آندزیت، داسیت، ریولیت، توف، آگلومرا، گابرو متمایز نشده. در ناحیه مکنزی، سرزمینهای شمال غربی

آرکئن
type: Concept
narrower: گروه یلونایف
preferred label: Archean @en