گروه رود جورج
type: Concept
broader: هادرینین
preferred label: George River Group @en
scope note: جزیره کیپ برتون،نووااسکوتیا،شامل کوارتزیت،مرمر، شیست و گنایس می‌باشد.

هادرینین
type: Concept
narrower: گروه رود جورج
preferred label: Hadrynian @en