گروه فورکو
type: Concept
broader: هادرینین
preferred label: Fourchu Group @en
scope note: هادرینین بالایی. جزیره کیپ برتون،شمال نووااسکوتیا.

هادرینین
type: Concept
narrower: گروه فورکو
preferred label: Hadrynian @en