ساسکاچوان
type: Concept
preferred label: Saskatchewan @en
related: سازند آتاباسکا

سازند آتاباسکا
type: Concept
broader: پروتروزوئیک(دوران)
preferred label: Athabasca Formation @en
related: ساسکاچوان
scope note: بطور اولیه یک کوارتزیت رسوبی است. روی یک منطقه بزرگ در جنوب دریاچه آتاباسکادر ایالت چرچیل کانادا رخنمون دارد.

پروتروزوئیک(دوران)
type: Concept
narrower: سازند آتاباسکا
preferred label: Proterozoic @en