سازند بیتر اسپرینگز
type: Concept
broader: پروتروزوئیک(دوران)
preferred label: Bitter Springs Formation @en
related: استرالیا
scope note: در زیر آن رسوبات کامبرین میانی و بالای آن کوارتزیت هیویتری. جنوب غرب و جنوب مرکز ایالت شمالی.

پروتروزوئیک(دوران)
type: Concept
narrower: سازند بیتر اسپرینگز
preferred label: Proterozoic @en

استرالیا
type: Concept
preferred label: Australia @en
related: سازند بیتر اسپرینگز