سری کورسک
type: Concept
broader: پروتروزوئیک(دوران)
preferred label: Kursk Series @en
related: فدراسیون روسیه
scope note: از نام شهری در ناحیه خودمختار کورسک در جنوب غرب روسیه فدراسیون گرفته شده است.

پروتروزوئیک(دوران)
type: Concept
narrower: سری کورسک
preferred label: Proterozoic @en

فدراسیون روسیه
type: Concept
preferred label: Russian Federation @en
related: سری کورسک