گروه چوار
type: Concept
broader: پرکامبرین
preferred label: Chuar Group @en
related: آریزونا
scope note: سری گراندکانیون. ناحیه گراند کانیون در شمال آریزونا

پرکامبرین
type: Concept
narrower: گروه چوار
preferred label: Precambrian @en

آریزونا
type: Concept
preferred label: Arizona @en
related: گروه چوار