پراگین
type: Concept
broader: دونین زیرین
preferred label: Pragian @en
scope note: اروپا. دونین زیرین، بالای لوچکووین و زیر زلیکووین

دونین زیرین
type: Concept
narrower: پراگین
preferred label: Lower Devonian @en