دیتونین
type: Concept
broader: دونین زیرین
preferred label: dittonian @en
related: ماسه‌سنگ قرمز قدیمی
scope note: در ماسه‌سنگ قرمز قدیمی انگلستان: گدینین بالایی، بالای داونتونین.

دونین زیرین
type: Concept
narrower: دیتونین
preferred label: Lower Devonian @en

ماسه‌سنگ قرمز قدیمی
type: Concept
preferred label: Old Red Sandstone @en
related: دیتونین