ریولیت بالاکلالا
type: Concept
broader: دونین میانی
preferred label: Balaklala Rhyolite @en
related: کالیفرنیا
scope note: شمال کالیفرنیا. با پوششی از بازالت سبز کوپلی و تداخل بین انگشتی با آن در بسیاری از مناطق

دونین میانی
type: Concept
narrower: ریولیت بالاکلالا
preferred label: Middle Devonian @en

کالیفرنیا
type: Concept
preferred label: California @en
related: ریولیت بالاکلالا