الکساندرین
type: Concept
alternative label: سری الکساندرین
broader: سیلورین زیرین
preferred label: Alexandrian @en
scope note: سری ایالتی آمریکای شمالی ؛ در سیلورین زیرین (بالای سین سیناسین اردویسین و زیر نیاگارن)

سیلورین زیرین
type: Concept
narrower: الکساندرین
preferred label: Lower Silurian @en