درسباچین
type: Concept
broader: کامبرین فوقانی
preferred label: Dresbachian @en
scope note: آمریکای شمالی. کامبرین بالایی، بالای آلبرتن و زیر فرانکونین.

کامبرین فوقانی
type: Concept
narrower: درسباچین
preferred label: Upper Cambrian @en