سازند سمینول
type: Concept
broader: میسورین
preferred label: Seminole Formation @en
related: اوکلاهما
scope note: در گروه اسکیاتوک. شمال شرق، مرکز و مرکز جنوب اوکلاهما

میسورین
type: Concept
narrower: سازند سمینول
preferred label: Missourian @en

اوکلاهما
type: Concept
preferred label: Oklahoma @en
related: سازند سمینول