سازند مانسفیلد
type: Concept
broader: پنسیلوانین
preferred label: Mansfield Formation @en
related: ایندیانا
scope note: پنسیلوانین زیرین و میانی. شامل مقادیر زیادی شیل، لایه های نازک زغال زیر رس و سنگ آهک و تنها بصورت محلی ماسه‌سنگ غلبه دارد.

پنسیلوانین
type: Concept
narrower: سازند مانسفیلد
preferred label: Pennsylvanian @en

ایندیانا
type: Concept
preferred label: Indiana @en
related: سازند مانسفیلد